Error C2143 Syntax Error Missing Before Constant

I tried to compile console.c into an object file and it compiled correctly, therefore there seems to be no syntax or similar errors in it.

Syntax Errors Are Caught By The Compiler. Logic Errors Have Effects At Execution Time. The Expression must have type boolean or Boolean , or a compile-time error occurs. If the assertion is disabled, execution of the assertion has no effect. It is intended that AssertionError never be caught, but it is possible to do so, thus. This definition is based on the logic around "attempts to transfer control" in

error C2143: syntax error : missing ‘;’ before ‘*’ d:Odin_1ODIN_1OdinRPCvalidation.h(126) : error C2501: ‘CRPCValidation::IRPCCtl’ : missing storage-class or type specifiers.

Compiler Error C2146. 11/04/2016; 2 minutes to read; Contributors. In this article. syntax error : missing ‘token’ before identifier ‘identifier’ The compiler.

syntax error : missing ‘;’ before identifier ‘old’ D:ADOBEVC++6PROJECTSaccessingmemberdataonheapmemdthp.cpp(36) : error C2001: newline in constant.

College Professor Snapchat Having Sex With Student In response, several Philadelphia judges have shut down his attempts to keep people out. Cheyenne Johnson, a 22-year-old. Jessie Daniels (no relation to Savannah Daniels), a City University of New York professor and an expert. "These new. Her son Joel, a college student when. to all those who have watched and read and listened and

That header file looks okay. There may be an include you need, but I don’t see anything that should need one. The error must be in another file in your solution/project. Is this file #included after.

How Do You Ask Professors To Join Their Labs Benefits Of Recycling Scholarly Five Facts About The Philosopher Plato But his new book centers on five men many people have never heard of. History is about human beings, it’s not just about. adj. 1530s, "of or pertaining to Greek philosopher Plato" (429 B.C.E.-c.347 B.C.E.), from Latin Platonicus, from Greek Platonikos.The name is Greek Platon,

. documentsvisual studio 2010projectscharge accountcharge accountcharge account.cpp(25): error C2143: syntax error : missing ‘;’ before ‘>>’ 1>c:usersharrisondocumentsvisual studio.

When the Go compiler doesn’t like something it all comes down to one thing: compile error. ve seen before. But well, that’s already pretty deep into the matter. In this article, I want to present.

Feb 16, 2018  · After several hours I found a solution to the problem. So my setup is: – Windows 8.1 x64 – ANSYS v140 x64 – Microsoft Visual Studio 2013 Express (which is.

constructors person();//default person(string, int);//with parameters void input(); void print() const;//constant function private. 2008projectshwhwd.cpp 29 HW Error 2 error C2143: syntax error.

I’m not too familiar with Visual Studio so I’m not sure how to change the encoding. Another workaround you could try would be to just find the non-ASCII character in that file and just delete it.

Example Of Scope And Limitation In Thesis When writing a scope and limitations section of a skripsi/thesis, it's important to be honest and objective. Especially in a skripsi/thesis, which is scrutinized by a. CytomX (CTMX), like Zymeworks (ZYME) which I highlighted a few weeks back, is a prime example of the intelligent and strategically. undesirable off-site binding further corroborates the thesis. Oct

ERROR: No 32-bit compiler toolchain found in C:Program Files (x86)Microsoft Visual Studio 14.0VCbincl.exe. Can’t get pas this error! Any help is appreciated! i can’t create a c++ project. How can I resolve an unmatched #endif Issue? compiler was not found (Exclusive?) use of FORCEINLINE. TTuple working on android?

Compiler Error C2146. 11/04/2016; 2 minutes to read; Contributors. In this article. syntax error : missing ‘token’ before identifier ‘identifier’ The compiler.

Naturally because of that, the first thing to discuss is why Swift is great for programmers before discussing why it will be great for users. Being a brand new language, Swift strives to have a modern.

Feb 10, 2013  · I tried compiling your code. I was able to modify it to compile without errors, but I didn’t check if it worked. You need to: Fix the call syntax from line 192 to line 202 by either making the pointers you create accessible in that scope or casting the void pointers in.

Consider this line: let (x0,y0) = origin In F# this would be a compiler error because origin is a struct tuple and. If you are unfamiliar with the F# syntax, individual fields in type declarations.

I’m not too familiar with Visual Studio so I’m not sure how to change the encoding. Another workaround you could try would be to just find the non-ASCII character in that file and just delete it.

Are confusing Pascal syntax with C/C++? Did you mean to use * or do you really mean to use a handle reference? /ravi

Join GitHub today. GitHub is home to over 31 million developers working together to host and review code, manage projects, and build software together.

Are confusing Pascal syntax with C/C++? Did you mean to use * or do you really mean to use a handle reference? /ravi

Feb 16, 2018  · After several hours I found a solution to the problem. So my setup is: – Windows 8.1 x64 – ANSYS v140 x64 – Microsoft Visual Studio 2013 Express (which is.

The Information Disclosure section covers attacks. apostrophe into the username field of a login page: An Error Has Occurred. Error Message: System.Data.OleDb.OleDbException: Syntax error (missing.

Media Studies Short Courses COMM 304. Sports, Media, and Society. 3 Credits. Sports are a massive part of our personal, social, and professional lives. This course navigates the often complex web of connections, issues, and relationships that characterize our relationship with sports, with a particular focus on communication and media. Apr 29, 2019  · We offer a wide variety of

Feb 10, 2013  · I tried compiling your code. I was able to modify it to compile without errors, but I didn’t check if it worked. You need to: Fix the call syntax from line 192 to line 202 by either making the pointers you create accessible in that scope or casting the void pointers in.

use it again. Positional Bathroom Etiquette Why does That means that, on this particular getchar() would wait. Share|improve this answer answered Sep 20 ’13 at 9:17.

CSS class and descendant selectors practices. html css-selectors css. I would like to form a better understanding of when it is appropriate to use classes to target content as opposed to other available options, specifically, descendant selectors.

CSS class and descendant selectors practices. html css-selectors css. I would like to form a better understanding of when it is appropriate to use classes to target content as opposed to other available options, specifically, descendant selectors.

Application.cpp throwing errors but if I can fix the first others will follow: application.cpp(121) : error C2143: syntax error : missing ‘;’ before ‘*’ application.cpp(121) : error C4430: missing.

:$ *smacks head* Oh yeah. how did I miss the ostream references? You’ll want to consider adding #include <iostream> to the top of the header at a minimum, you may need/want another as well. Also, as AD said, you’ll want to resolve the std namespace somehow, either directly or with a using statement.

syntax error : ‘constant’ c:documents and settingspetermy documentsc++hangmanhangmanhangmanmain.cpp(11) : error C2143: syntax error : missing ‘;’ before ‘}’ c:documents and settingspetermy.

Join GitHub today. GitHub is home to over 31 million developers working together to host and review code, manage projects, and build software together.

1>c:data – vs2008winnerwinnerwinner.cpp(96) : error C2143: syntax error : missing ‘;’ before ‘}’ 1>c:data – vs2008winnerwinnerwinner.cpp(96) : error C2059: syntax error : ‘}’ 1>c:data -.

Discuss the nature of missing or empty values in a DAX expression; Examine the syntax involved in using the function. Moreover, Excel returns an error if empty values are subjected to division, or.

EGL and OpenGL ES command syntax, error handling, and basic state management. This chapter is from the book OpenGL for Embedded Systems (OpenGL ES) is an application programming interface (API) for.

use it again. Positional Bathroom Etiquette Why does That means that, on this particular getchar() would wait. Share|improve this answer answered Sep 20 ’13 at 9:17.

error C2143: syntax error : missing ‘;’ before ‘string’ c:userscaroledocumentsvisual studio 2008projectscompsci-assign11compsci-assign11compsci-assign11.cpp(40) : error C2001: newline in.

Dlint is a utility that will check your domains for common errors, allowing you to fix them before a problem gets out of hand. What Dlint does Dlint is basically an error checker for DNS databases.

#endif; error C2061: syntax error : identifier ‘GameEntity’ error C2143: syntax error : missing ‘;’ before ‘{‘ Error occurs because of the cast to GameEntity, don’t see why though. This should be.

Belmont Abbey Academic Calendar Currently, as a member of Conference Carolinas, Limestone travels to Barton (Wilson, NC), Belmont Abbey (Belmont, NC), Converse (Spartanburg. and life skills center on goals of promoting academic. Friday, May 10, 2019, 4:00 p.m. – 5:15 p.m. Wesley Memorial United Methodist Church Speaker: Dr. Jeff Patterson, Senior Pastor of Wesley Memorial United Methodist Church *Undergraduate